Target
Prostacyclin receptor
Ligand
BDBM50171481
Substrate
Meas. Tech.
ChEMBL_303625 (CHEMBL828836)
Ki
4700±n/a nM
Citation
 Ohno, MMiyamoto, MHoshi, KTakeda, TYamada, NOhtake, A Development of dual-acting benzofurans for thromboxane A2 receptor antagonist and prostacyclin receptor agonist: synthesis, structure-activity relationship, and evaluation of benzofuran derivatives. J Med Chem 48:5279-94 (2005)  
Target
Name:
Prostacyclin receptor
Synonyms:
PGI receptor PRIPR Prostacyclin (IP) Receptor Prostaglandin I Prostaglandin I2 receptor | Prostanoid IP receptor
Type:
G Protein-Coupled Receptor (GPCR)
Mol. Mass.:
40968.22
Organism:
Homo sapiens (Human)
Description:
The membranes prepared from human platelet were used in binding assay.
Residue:
386
  
Inhibitor
Name:
BDBM50171481
Synonyms:
(3-Benzhydrylsulfanylmethyl-benzofuran-7-yloxy)-acetic acid | CHEMBL192661
Type:
Small organic molecule
Emp. Form.:
C24H20O4S
Mol. Mass.:
404.478
SMILES:
OC(=O)COc1cccc2c(CSC(c3ccccc3)c3ccccc3)coc12
: