Target
Prostacyclin receptor
Ligand
BDBM50171465
Substrate
Meas. Tech.
ChEMBL_303625 (CHEMBL828836)
Ki
750±n/a nM
Citation
 Ohno, MMiyamoto, MHoshi, KTakeda, TYamada, NOhtake, A Development of dual-acting benzofurans for thromboxane A2 receptor antagonist and prostacyclin receptor agonist: synthesis, structure-activity relationship, and evaluation of benzofuran derivatives. J Med Chem 48:5279-94 (2005)  
Target
Name:
Prostacyclin receptor
Synonyms:
PGI receptor PRIPR Prostacyclin (IP) Receptor Prostaglandin I Prostaglandin I2 receptor | Prostanoid IP receptor
Type:
G Protein-Coupled Receptor (GPCR)
Mol. Mass.:
40968.22
Organism:
Homo sapiens (Human)
Description:
The membranes prepared from human platelet were used in binding assay.
Residue:
386
  
Inhibitor
Name:
BDBM50171465
Synonyms:
CHEMBL190708 | [3-(2-Benzhydrylsulfanyl-ethyl)-2-hydroxymethyl-benzofuran-7-yloxy]-acetic acid
Type:
Small organic molecule
Emp. Form.:
C26H24O5S
Mol. Mass.:
448.531
SMILES:
OCc1oc2c(OCC(O)=O)cccc2c1CCSC(c1ccccc1)c1ccccc1
: