Target
Epidermal growth factor receptor
Ligand
BDBM50171520
Substrate
Meas. Tech.
ChEMBL_305171 (CHEMBL832761)
IC50
0.11±n/a nM
Citation
 Mishani, EAbourbeh, GJacobson, ODissoki, SBen Daniel, RRozen, YShaul, MLevitzki, A High-affinity epidermal growth factor receptor (EGFR) irreversible inhibitors with diminished chemical reactivities as positron emission tomography (PET)-imaging agent candidates of EGFR overexpressing tumors. J Med Chem 48:5337-48 (2005)  
Target
Name:
Epidermal growth factor receptor
Synonyms:
EGF Receptor Substrate EGFR_HUMAN ERBB1 Epidermal Growth Factor Receptor erbB-1 Epidermal growth factor receptor (EGFR) HER1 Proto-oncogene c-ErbB-1 Tyrosine-Protein Kinase ErbB-1
Type:
Receptor Kinase Domain
Mol. Mass.:
134279.59
Organism:
Homo sapiens (Human)
Description:
P00533
Residue:
1210
  
Inhibitor
Name:
BDBM50171520
Synonyms:
(E)-4-Dimethylamino-but-2-enoic acid [4-(4,5-dichloro-2-fluoro-phenylamino)-quinazolin-6-yl]-amide | CHEMBL190094
Type:
Small organic molecule
Emp. Form.:
C20H18Cl2FN5O
Mol. Mass.:
434.294
SMILES:
CN(C)C\C=C\C(=O)Nc1ccc2ncnc(Nc3cc(Cl)c(Cl)cc3F)c2c1
: