Target
Vascular endothelial growth factor receptor 2
Ligand
BDBM4810
Substrate
Meas. Tech.
ChEMBL_305381 (CHEMBL876999)
IC50
230±n/a nM
Citation
 Bouérat, LFensholdt, JLiang, XHavez, SNielsen, SFHansen, JRBolvig, SAndersson, C Indolin-2-ones with high in vivo efficacy in a model for multiple sclerosis. J Med Chem 48:5412-4 (2005)  
Target
Name:
Vascular endothelial growth factor receptor 2
Synonyms:
CD_antigen=CD309 Fetal liver kinase 1 (FLK-1) KDR Protein-tyrosine kinase receptor Flk-1 VEGFR-2 VEGFR2 Vascular Endothelial Growth Factor Receptor Kinase 2 Vascular endothelial growth factor receptor 2 (KDR) Vascular endothelial growth factor receptor 2 (VEGFR2) Vascular endothelial growth factor receptor-2 (VEGFR-2)
Type:
Receptor Tyrosine Kinase
Mol. Mass.:
151510.97
Organism:
Homo sapiens (Human)
Description:
P35968
Residue:
1356
  
Inhibitor
Name:
BDBM4810
Synonyms:
(3Z)-3-[(3,5-dimethyl-1H-pyrrol-2-yl)methylidene]-2,3-dihydro-1H-indol-2-one CHEMBL276711 SU5416 US10189853, semaxanib US9422297, SU5416 | cid_5329098
Type:
Small organic molecule
Emp. Form.:
C15H14N2O
Mol. Mass.:
238.2845
SMILES:
Cc1cc(C)c(\C=C2/C(=O)Nc3ccccc23)[nH]1
: