Target
Peroxisome proliferator-activated receptor alpha
Ligand
BDBM50171996
Substrate
Meas. Tech.
ChEMBL_310800 (CHEMBL824851)
EC50
8±n/a nM
Citation
 Shi, GQDropinski, JFZhang, YSantini, CSahoo, SPBerger, JPMacnaul, KLZhou, GAgrawal, AAlvaro, RCai, TQHernandez, MWright, SDMoller, DEHeck, JVMeinke, PT Novel 2,3-dihydrobenzofuran-2-carboxylic acids: highly potent and subtype-selective PPARalpha agonists with potent hypolipidemic activity. J Med Chem 48:5589-99 (2005)  
Target
Name:
Peroxisome proliferator-activated receptor alpha
Synonyms:
NR1C1 PPAR PPAR-alpha PPARA_HUMAN Peroxisome proliferator-activated receptor | Peroxisome proliferator-activated receptor alpha (PPAR alpha)
Type:
Enzyme
Mol. Mass.:
52222.08
Organism:
Homo sapiens (Human)
Description:
Q07869
Residue:
468
  
Inhibitor
Name:
BDBM50171996
Synonyms:
2-Ethyl-5-[3-(2-propyl-4-trifluoromethylsulfanyl-phenoxy)-propoxy]-2,3-dihydro-benzofuran-2-carboxylic acid | CHEMBL192500
Type:
Small organic molecule
Emp. Form.:
C24H27F3O5S
Mol. Mass.:
484.528
SMILES:
CCCc1cc(SC(F)(F)F)ccc1OCCCOc1ccc2OC(CC)(Cc2c1)C(O)=O
: