Target
Oxysterols receptor LXR-beta
Ligand
BDBM50172188
Substrate
Meas. Tech.
ChEMBL_321167 (CHEMBL882896)
IC50
100±n/a nM
Citation
 Liu, WChen, SDropinski, JColwell, LRobins, MSzymonifka, MHayes, NSharma, NMacNaul, KHernandez, MBurton, CSparrow, CPMenke, JGSingh, SB Design, synthesis, and structure-activity relationship of podocarpic acid amides as liver X receptor agonists for potential treatment of atherosclerosis. Bioorg Med Chem Lett 15:4574-8 (2005)  
Target
Name:
Oxysterols receptor LXR-beta
Synonyms:
LXRB Liver X, LXR beta NR1H2 Nuclear receptor NER Ubiquitously-expressed nuclear receptor
Type:
Enzyme Catalytic Domain
Mol. Mass.:
50978.79
Organism:
Homo sapiens (Human)
Description:
P55055
Residue:
460
  
Inhibitor
Name:
BDBM50172188
Synonyms:
(4S,4aR)-6-Hydroxy-4a-methyl-1-(S)-methyl-1,2,3,4,4a,9,10,10a-octahydro-phenanthrene-1-carboxylic acid adamantan-2-ylamide | CHEMBL194409
Type:
Small organic molecule
Emp. Form.:
C27H37NO2
Mol. Mass.:
407.5882
SMILES:
C[C@@]1(CCC[C@@]2(C)[C@H]1CCc1ccc(O)cc21)C(=O)NC1C2CC3CC(C2)CC1C3
: