Target
Oxysterols receptor LXR-alpha
Ligand
BDBM50167694
Substrate
Meas. Tech.
ChEMBL_321113 (CHEMBL882879)
EC50
10±n/a nM
Citation
 Liu, WChen, SDropinski, JColwell, LRobins, MSzymonifka, MHayes, NSharma, NMacNaul, KHernandez, MBurton, CSparrow, CPMenke, JGSingh, SB Design, synthesis, and structure-activity relationship of podocarpic acid amides as liver X receptor agonists for potential treatment of atherosclerosis. Bioorg Med Chem Lett 15:4574-8 (2005)  
Target
Name:
Oxysterols receptor LXR-alpha
Synonyms:
LXRA Liver X receptor alpha Liver X receptor alpha (NR1H3) NR1H3 Nuclear orphan receptor LXR-alpha | Nuclear receptor subfamily 1 group H member 3
Type:
Enzyme Catalytic Domain
Mol. Mass.:
50403.85
Organism:
Homo sapiens (Human)
Description:
Q13133
Residue:
447
  
Inhibitor
Name:
BDBM50167694
Synonyms:
2,6-dimethyl-13-methylcarbonyloxy-(2S)-tricyclo[8.4.0.02,7]tetradeca-1(10),11,13-triene-6-carboxylic 2,6-dimethyl-13-methylcarbonyloxy-(2S,6S,7R)-tricyclo[8.4.0.02,7]tetradeca-1(14),10,12-triene-6-carboxylic anhydride CHEMBL191965
Type:
Small organic molecule
Emp. Form.:
C38H46O7
Mol. Mass.:
614.7676
SMILES:
CC(=O)Oc1ccc2CC[C@H]3C(C)(CCC[C@]3(C)c2c1)C(=O)OC(=O)[C@@]1(C)CCC[C@@]2(C)[C@H]1CCc1ccc(OC(C)=O)cc21
: