Target
Cytochrome P450 2C19
Ligand
BDBM50201124
Substrate
Meas. Tech.
ChEMBL_321410 (CHEMBL881941)
IC50
26±n/a nM
Citation
 Wittman, MCarboni, JAttar, RBalasubramanian, BBalimane, PBrassil, PBeaulieu, FChang, CClarke, WDell, JEummer, JFrennesson, DGottardis, MGreer, AHansel, SHurlburt, WJacobson, BKrishnananthan, SLee, FYLi, ALin, TALiu, POuellet, CSang, XSaulnier, MGStoffan, KSun, YVelaparthi, UWong, HYang, ZZimmermann, KZoeckler, MVyas, D Discovery of a (1H-benzoimidazol-2-yl)-1H-pyridin-2-one (BMS-536924) inhibitor of insulin-like growth factor I receptor kinase with in vivo antitumor activity. J Med Chem 48:5639-43 (2005)  
Target
Name:
Cytochrome P450 2C19
Synonyms:
CP2CJ_HUMAN CYPIIC17 Cytochrome P450 2C19 (CYP2C19) Mephenytoin 4-hydroxylase P450-254C
Type:
Enzyme
Mol. Mass.:
55935.47
Organism:
Homo sapiens (Human)
Description:
P33261
Residue:
490
  
Inhibitor
Name:
BDBM50201124
Synonyms:
3-(6-(1H-imidazol-1-yl)-4-methyl-1H-benzo[d]imidazol-2-yl)-4-(2-(3-chlorophenyl)-2-hydroxyethylamino)pyridin-2(1H)-one CHEMBL231306
Type:
Small organic molecule
Emp. Form.:
C24H21ClN6O2
Mol. Mass.:
460.916
SMILES:
Cc1cc(cc2nc([nH]c12)-c1c(NCC(O)c2cccc(Cl)c2)cc[nH]c1=O)-n1ccnc1
: