Target
Serine protease 1/Trypsin-2
Ligand
BDBM50172835
Substrate
Meas. Tech.
ChEMBL_320753 (CHEMBL884567)
Ki
17±n/a nM
Citation
 Deng, JZMcMasters, DRRabbat, PMWilliams, PDCoburn, CAYan, YKuo, LCLewis, SDLucas, BJKrueger, JAStrulovici, BVacca, JPLyle, TABurgey, CS Development of an oxazolopyridine series of dual thrombin/factor Xa inhibitors via structure-guided lead optimization. Bioorg Med Chem Lett 15:4411-6 (2005)  
Target
Name:
Serine protease 1/Trypsin-2
Synonyms:
Trypsin II
Type:
Mol. Mass.:
Description:
ASSAY_ID of EBI is 212335
Components:
This complex has 2 components.
Component 1
Name:
Serine protease 1
Synonyms:
Alpha-trypsin chain 1 Beta-trypsin PRSS1 TRP1 TRY1_HUMAN Thrombin & trypsin Trypsin I | Trypsin-1
Type:
Enzyme
Mol. Mass.:
26557.80
Organism:
Homo sapiens (Human)
Description:
P07477
Residue:
247
  
Component 2
Name:
Trypsin-2
Synonyms:
Anionic trypsinogen Serine protease 2 TRY2_HUMAN Thrombin & trypsin Trypsin II | Trypsin-2
Type:
PROTEIN
Mol. Mass.:
26479.43
Organism:
Homo sapiens (Human)
Description:
ChEMBL_41517
Residue:
247
  
Inhibitor
Name:
BDBM50172835
Synonyms:
(2,2-Difluoro-2-piperidin-2-yl-ethyl)-[2-(2-tetrazol-1-yl-benzyl)-oxazolo[4,5-c]pyridin-4-yl]-amine | CHEMBL198416
Type:
Small organic molecule
Emp. Form.:
C21H22F2N8O
Mol. Mass.:
440.4492
SMILES:
FC(F)(CNc1nccc2oc(Cc3ccccc3-n3cnnn3)nc12)C1CCCCN1
: