Target
Delta-type opioid receptor
Ligand
BDBM50173090
Substrate
Meas. Tech.
ChEMBL_320775 (CHEMBL884730)
Ki
>10000±n/a nM
Citation
 Huang, YBae, SARoth, BLLaruelle, M Synthesis of potent and selective serotonin 5-HT1B receptor ligands. Bioorg Med Chem Lett 15:4786-9 (2005)  
Target
Name:
Delta-type opioid receptor
Synonyms:
D-OR-1 Delta opioid receptor OPIATE Delta OPRD1 OPRK1 | opioid receptor, delta 1
Type:
G Protein-Coupled Receptor (GPCR)
Mol. Mass.:
40382.98
Organism:
Homo sapiens (Human)
Description:
Competition binding assays were carried out using membrane preparations from transfected HN9.10 cells that constitutively expressed the delta opioid receptor.
Residue:
372
  
Inhibitor
Name:
BDBM50173090
Synonyms:
4-(4-Fluoro-phenyl)-piperazine-1-carboxylic acid [4-methoxy-3-(4-methyl-piperazin-1-yl)-phenyl]-amide | CHEMBL194206
Type:
Small organic molecule
Emp. Form.:
C23H30FN5O2
Mol. Mass.:
427.515
SMILES:
COc1ccc(NC(=O)N2CCN(CC2)c2ccc(F)cc2)cc1N1CCN(C)CC1
: