Target
Muscarinic acetylcholine receptor M4
Ligand
BDBM50173090
Substrate
Meas. Tech.
ChEMBL_320818 (CHEMBL872353)
Ki
>10000±n/a nM
Citation
 Huang, YBae, SARoth, BLLaruelle, M Synthesis of potent and selective serotonin 5-HT1B receptor ligands. Bioorg Med Chem Lett 15:4786-9 (2005)  
Target
Name:
Muscarinic acetylcholine receptor M4
Synonyms:
ACM4_HUMAN Cholinergic, muscarinic M4 Muscarinic acetylcholine receptor M2 and M4
Type:
Enzyme Catalytic Domain
Mol. Mass.:
53079.31
Organism:
Homo sapiens (Human)
Description:
Cholinergic, muscarinic M4 CHRM4 HUMAN M3::P08173
Residue:
479
  
Inhibitor
Name:
BDBM50173090
Synonyms:
4-(4-Fluoro-phenyl)-piperazine-1-carboxylic acid [4-methoxy-3-(4-methyl-piperazin-1-yl)-phenyl]-amide | CHEMBL194206
Type:
Small organic molecule
Emp. Form.:
C23H30FN5O2
Mol. Mass.:
427.515
SMILES:
COc1ccc(NC(=O)N2CCN(CC2)c2ccc(F)cc2)cc1N1CCN(C)CC1
: