Target
Kappa-type opioid receptor
Ligand
BDBM50173098
Substrate
Meas. Tech.
ChEMBL_320776 (CHEMBL884731)
Ki
>10000±n/a nM
Citation
 Huang, YBae, SARoth, BLLaruelle, M Synthesis of potent and selective serotonin 5-HT1B receptor ligands. Bioorg Med Chem Lett 15:4786-9 (2005)  
Target
Name:
Kappa-type opioid receptor
Synonyms:
K-OR-1 Kappa-opioid receptor (KOR) Kappa-type opioid receptor (KOR) OPIATE Kappa OPRK1 kappa opioid receptor (KOR)
Type:
G Protein-Coupled Receptor (GPCR)
Mol. Mass.:
42648.76
Organism:
Homo sapiens (Human)
Description:
P41145
Residue:
380
  
Inhibitor
Name:
BDBM50173098
Synonyms:
4-(2-Methoxy-phenyl)-piperazine-1-carboxylic acid [4-methoxy-3-(4-methyl-piperazin-1-yl)-phenyl]-amide CHEMBL430500
Type:
Small organic molecule
Emp. Form.:
C24H33N5O3
Mol. Mass.:
439.5505
SMILES:
COc1ccccc1N1CCN(CC1)C(=O)Nc1ccc(OC)c(c1)N1CCN(C)CC1
: