Target
5-hydroxytryptamine receptor 1D
Ligand
BDBM50173092
Substrate
Meas. Tech.
ChEMBL_320822 (CHEMBL872357)
Ki
103±n/a nM
Citation
 Huang, YBae, SARoth, BLLaruelle, M Synthesis of potent and selective serotonin 5-HT1B receptor ligands. Bioorg Med Chem Lett 15:4786-9 (2005)  
Target
Name:
5-hydroxytryptamine receptor 1D
Synonyms:
5-HT-1D 5-HT1D 5HT1D_HUMAN HTR1DA Serotonin (5-HT) receptor | Serotonin Receptor 1D
Type:
G Protein-Coupled Receptor (GPCR)
Mol. Mass.:
41920.63
Organism:
Homo sapiens (Human)
Description:
Receptor binding assays were performed using human clone stably expressed in CHO cells.
Residue:
377
  
Inhibitor
Name:
BDBM50173092
Synonyms:
4-(2-Fluoro-phenyl)-piperazine-1-carboxylic acid [4-methoxy-3-(4-methyl-piperazin-1-yl)-phenyl]-amide | CHEMBL196169
Type:
Small organic molecule
Emp. Form.:
C23H30FN5O2
Mol. Mass.:
427.515
SMILES:
COc1ccc(NC(=O)N2CCN(CC2)c2ccccc2F)cc1N1CCN(C)CC1
: