Target
Dihydroorotate dehydrogenase (quinone), mitochondrial
Ligand
BDBM50173147
Substrate
Meas. Tech.
ChEMBL_321456 (CHEMBL879486)
IC50
1460±n/a nM
Citation
 Leban, JKralik, MMies, JGassen, MTentschert, KBaumgartner, R SAR, species specificity, and cellular activity of cyclopentene dicarboxylic acid amides as DHODH inhibitors. Bioorg Med Chem Lett 15:4854-7 (2005)  
Target
Name:
Dihydroorotate dehydrogenase (quinone), mitochondrial
Synonyms:
DHODH Dihydroorotate dehydrogenase Dihydroorotate dehydrogenase, mitochondrial Dihydroorotate oxidase (DHODH) | PYRD_HUMAN
Type:
Enzyme
Mol. Mass.:
42881.33
Organism:
Homo sapiens (Human)
Description:
Q02127
Residue:
395
  
Inhibitor
Name:
BDBM50173147
Synonyms:
2-(3-Fluoro-3'-methoxy-biphenyl-4-ylcarbamoyl)-3-hydroxy-cyclopent-1-enecarboxylic acid | CHEMBL196256
Type:
Small organic molecule
Emp. Form.:
C20H18FNO5
Mol. Mass.:
371.359
SMILES:
COc1cccc(c1)-c1ccc(NC(=O)C2=C(CCC2O)C(O)=O)c(F)c1
: