Target
Neutrophil collagenase
Ligand
BDBM50173231
Substrate
Meas. Tech.
ChEMBL_321188 (CHEMBL882917)
IC50
110±n/a nM
Citation
 Li, JRush, TSLi, WDeVincentis, DDu, XHu, YThomason, JRXiang, JSSkotnicki, JSTam, SCunningham, KMChockalingam, PSMorris, EALevin, JI Synthesis and SAR of highly selective MMP-13 inhibitors. Bioorg Med Chem Lett 15:4961-6 (2005)  
Target
Name:
Neutrophil collagenase
Synonyms:
CLG1 MMP8 Matrix metalloproteinase-8 PMNL collagenase | PMNL-CL
Type:
Enzyme
Mol. Mass.:
53413.48
Organism:
Homo sapiens (Human)
Description:
P22894
Residue:
467
  
Inhibitor
Name:
BDBM50173231
Synonyms:
(S)-2-{4'-[(5-Chloro-4-isopropoxy-3-methyl-benzofuran-2-carbonyl)-amino]-biphenyl-4-sulfonylamino}-3-methyl-butyric acid | CHEMBL194430
Type:
Small organic molecule
Emp. Form.:
C30H31ClN2O7S
Mol. Mass.:
599.094
SMILES:
CC(C)Oc1c(Cl)ccc2oc(C(=O)Nc3ccc(cc3)-c3ccc(cc3)S(=O)(=O)N[C@@H](C(C)C)C(O)=O)c(C)c12
: