Target
Peroxisome proliferator-activated receptor alpha
Ligand
BDBM50173348
Substrate
Meas. Tech.
ChEMBL_321484 (CHEMBL880425)
IC50
>4482±n/a nM
Citation
 Dropinski, JFAkiyama, TEinstein, MHabulihaz, BDoebber, TBerger, JPMeinke, PTShi, GQ Synthesis and biological activities of novel aryl indole-2-carboxylic acid analogs as PPARgamma partial agonists. Bioorg Med Chem Lett 15:5035-8 (2005)  
Target
Name:
Peroxisome proliferator-activated receptor alpha
Synonyms:
NR1C1 PPAR PPAR-alpha PPARA_HUMAN Peroxisome proliferator-activated receptor | Peroxisome proliferator-activated receptor alpha (PPAR alpha)
Type:
Enzyme
Mol. Mass.:
52222.08
Organism:
Homo sapiens (Human)
Description:
Q07869
Residue:
468
  
Inhibitor
Name:
BDBM50173348
Synonyms:
1-(4-tert-Butyl-phenyl)-5-chloro-3-(4-chloro-3-trifluoromethyl-phenoxy)-1H-indole-2-carboxylic acid | CHEMBL370648
Type:
Small organic molecule
Emp. Form.:
C26H20Cl2F3NO3
Mol. Mass.:
522.343
SMILES:
CC(C)(C)c1ccc(cc1)-n1c(C(O)=O)c(Oc2ccc(Cl)c(c2)C(F)(F)F)c2cc(Cl)ccc12
: