Target
Peroxisome proliferator-activated receptor alpha
Ligand
BDBM50173341
Substrate
Meas. Tech.
ChEMBL_321484 (CHEMBL880425)
IC50
3577±n/a nM
Citation
 Dropinski, JFAkiyama, TEinstein, MHabulihaz, BDoebber, TBerger, JPMeinke, PTShi, GQ Synthesis and biological activities of novel aryl indole-2-carboxylic acid analogs as PPARgamma partial agonists. Bioorg Med Chem Lett 15:5035-8 (2005)  
Target
Name:
Peroxisome proliferator-activated receptor alpha
Synonyms:
NR1C1 PPAR PPAR-alpha PPARA_HUMAN Peroxisome proliferator-activated receptor | Peroxisome proliferator-activated receptor alpha (PPAR alpha)
Type:
Enzyme
Mol. Mass.:
52222.08
Organism:
Homo sapiens (Human)
Description:
Q07869
Residue:
468
  
Inhibitor
Name:
BDBM50173341
Synonyms:
1-(4-tert-Butyl-phenyl)-3-(4-trifluoromethoxy-phenoxy)-1H-indole-2-carboxylic acid | CHEMBL196428
Type:
Small organic molecule
Emp. Form.:
C26H22F3NO4
Mol. Mass.:
469.4524
SMILES:
CC(C)(C)c1ccc(cc1)-n1c(C(O)=O)c(Oc2ccc(OC(F)(F)F)cc2)c2ccccc12
: