Target
Peroxisome proliferator-activated receptor gamma
Ligand
BDBM50173350
Substrate
Meas. Tech.
ChEMBL_321485 (CHEMBL880426)
IC50
120±n/a nM
Citation
 Dropinski, JFAkiyama, TEinstein, MHabulihaz, BDoebber, TBerger, JPMeinke, PTShi, GQ Synthesis and biological activities of novel aryl indole-2-carboxylic acid analogs as PPARgamma partial agonists. Bioorg Med Chem Lett 15:5035-8 (2005)  
Target
Name:
Peroxisome proliferator-activated receptor gamma
Synonyms:
NR1C3 PPAR-gamma PPARG_HUMAN Peroxisome proliferator-activated receptor gamma (PPAR gamma) Peroxisome proliferator-activated receptor gamma (PPARĪ³) peroxisome proliferator-activated receptor gamma isoform 2
Type:
Nuclear Receptor
Mol. Mass.:
57613.46
Organism:
Homo sapiens (Human)
Description:
P37231
Residue:
505
  
Inhibitor
Name:
BDBM50173350
Synonyms:
1-(3-Isopropyl-phenyl)-3-(4-trifluoromethyl-phenoxy)-1H-indole-2-carboxylic acid | CHEMBL197637
Type:
Small organic molecule
Emp. Form.:
C25H20F3NO3
Mol. Mass.:
439.4264
SMILES:
CC(C)c1cccc(c1)-n1c(C(O)=O)c(Oc2ccc(cc2)C(F)(F)F)c2ccccc12
: