Target
Peroxisome proliferator-activated receptor alpha
Ligand
BDBM50173343
Substrate
Meas. Tech.
ChEMBL_321484 (CHEMBL880425)
IC50
>15000±n/a nM
Citation
 Dropinski, JFAkiyama, TEinstein, MHabulihaz, BDoebber, TBerger, JPMeinke, PTShi, GQ Synthesis and biological activities of novel aryl indole-2-carboxylic acid analogs as PPARgamma partial agonists. Bioorg Med Chem Lett 15:5035-8 (2005)  
Target
Name:
Peroxisome proliferator-activated receptor alpha
Synonyms:
NR1C1 PPAR PPAR-alpha PPARA_HUMAN Peroxisome proliferator-activated receptor | Peroxisome proliferator-activated receptor alpha (PPAR alpha)
Type:
Enzyme
Mol. Mass.:
52222.08
Organism:
Homo sapiens (Human)
Description:
Q07869
Residue:
468
  
Inhibitor
Name:
BDBM50173343
Synonyms:
1-(4-tert-Butyl-phenyl)-6-chloro-3-(3-isopropyl-phenoxy)-1H-indole-2-carboxylic acid | CHEMBL372639
Type:
Small organic molecule
Emp. Form.:
C28H28ClNO3
Mol. Mass.:
461.98
SMILES:
CC(C)c1cccc(Oc2c(C(O)=O)n(-c3ccc(cc3)C(C)(C)C)c3cc(Cl)ccc23)c1
: