Target
Cathepsin B
Ligand
BDBM19854
Substrate
Meas. Tech.
ChEMBL_321236 (CHEMBL881771)
IC50
1050±n/a nM
Citation
 Black, WCBayly, CIDavis, DEDesmarais, SFalgueyret, JPLéger, SLi, CSMassé, FMcKay, DJPalmer, JTPercival, MDRobichaud, JTsou, NZamboni, R Trifluoroethylamines as amide isosteres in inhibitors of cathepsin K. Bioorg Med Chem Lett 15:4741-4 (2005)  
Target
Name:
Cathepsin B
Synonyms:
APP secretase CATB_HUMAN CTSB Cathepsin B light chain | Cathepsin B1
Type:
Enzyme
Mol. Mass.:
37819.69
Organism:
Homo sapiens (Human)
Description:
gi_63102437
Residue:
339
  
Inhibitor
Name:
BDBM19854
Synonyms:
CHEMBL426819 N-{1-[(cyanomethyl)carbamoyl]cyclohexyl}-4-[2-(4-methylpiperazin-1-yl)-1,3-thiazol-4-yl]benzamide | basic piperazine-containing compound, 1
Type:
Small organic molecule
Emp. Form.:
C24H30N6O2S
Mol. Mass.:
466.599
SMILES:
CN1CCN(CC1)c1nc(cs1)-c1ccc(cc1)C(=O)NC1(CCCCC1)C(=O)NCC#N
: