Target
Mitogen-activated protein kinase kinase kinase 1
Ligand
BDBM50173609
Substrate
Meas. Tech.
ChEMBL_321430 (CHEMBL880238)
IC50
>10000±n/a nM
Citation
 Miwatashi, SArikawa, YKotani, EMiyamoto, MNaruo, KKimura, HTanaka, TAsahi, SOhkawa, S Novel inhibitor of p38 MAP kinase as an anti-TNF-alpha drug: discovery of N-[4-[2-ethyl-4-(3-methylphenyl)-1,3-thiazol-5-yl]-2-pyridyl]benzamide (TAK-715) as a potent and orally active anti-rheumatoid arthritis agent. J Med Chem 48:5966-79 (2005)  
Target
Name:
Mitogen-activated protein kinase kinase kinase 1
Synonyms:
M3K1_HUMAN MAPK/ERK kinase kinase 1 MEK Kinase 1 (MEKK1) MEKK1
Type:
Serine/threonine-protein kinase
Mol. Mass.:
164491.32
Organism:
Homo sapiens (Human)
Description:
Residue:
1512
  
Inhibitor
Name:
BDBM50173609
Synonyms:
CHEMBL363648 N-[4-(2-Ethyl-4-m-tolyl-thiazol-5-yl)-pyridin-2-yl]-benzamide | US10865384, Compound TAK-715
Type:
Small organic molecule
Emp. Form.:
C24H21N3OS
Mol. Mass.:
399.508
SMILES:
CCc1nc(c(s1)-c1ccnc(NC(=O)c2ccccc2)c1)-c1cccc(C)c1
: