Target
Estrogen receptor beta
Ligand
BDBM50173652
Substrate
Meas. Tech.
ChEMBL_320908 (CHEMBL881235)
Ki
0.19±n/a nM
Citation
 Clegg, NJParuthiyil, SLeitman, DCScanlan, TS Differential response of estrogen receptor subtypes to 1,3-diarylindene and 2,3-diarylindene ligands. J Med Chem 48:5989-6003 (2005)  
Target
Name:
Estrogen receptor beta
Synonyms:
ER-beta ESR2_HUMAN Estradiol receptor beta (ERβ) Estrogen receptor (ER beta) Estrogen receptor beta (ER beta) NR3A2 estrogen beta
Type:
Protein
Mol. Mass.:
59238.43
Organism:
Homo sapiens (Human)
Description:
Q92731
Residue:
530
  
Inhibitor
Name:
BDBM50173652
Synonyms:
2-(4-Hydroxy-phenyl)-1-[4-(2-piperidin-1-yl-ethoxy)-phenyl]-3H-inden-5-ol | CHEMBL381645
Type:
Small organic molecule
Emp. Form.:
C28H29NO3
Mol. Mass.:
427.5348
SMILES:
Oc1ccc(cc1)C1=C(c2ccc(O)cc2C1)c1ccc(OCCN2CCCCC2)cc1
: