Target
Estrogen receptor beta
Ligand
BDBM50173661
Substrate
Meas. Tech.
ChEMBL_321123 (CHEMBL881383)
EC50
0.3±n/a nM
Citation
 Clegg, NJParuthiyil, SLeitman, DCScanlan, TS Differential response of estrogen receptor subtypes to 1,3-diarylindene and 2,3-diarylindene ligands. J Med Chem 48:5989-6003 (2005)  
Target
Name:
Estrogen receptor beta
Synonyms:
ER-beta ESR2_HUMAN Estradiol receptor beta (ERβ) Estrogen receptor (ER beta) Estrogen receptor beta (ER beta) NR3A2 estrogen beta
Type:
Protein
Mol. Mass.:
59238.43
Organism:
Homo sapiens (Human)
Description:
Q92731
Residue:
530
  
Inhibitor
Name:
BDBM50173661
Synonyms:
1,3-Diethyl-2-(4-hydroxy-phenyl)-3H-inden-5-ol | CHEMBL306878
Type:
Small organic molecule
Emp. Form.:
C19H20O2
Mol. Mass.:
280.3609
SMILES:
CCC1C(=C(CC)c2ccc(O)cc12)c1ccc(O)cc1
: