Target
Thyrotropin-releasing hormone receptor
Ligand
BDBM50173822
Substrate
Meas. Tech.
ChEMBL_321009 (CHEMBL872293)
pH
7.4±n/a
Ki
>100000±n/a nM
Comments
extracted
Citation
 Kaur, NLu, XGershengorn, MCJain, R Thyrotropin-releasing hormone (TRH) analogues that exhibit selectivity to TRH receptor subtype 2. J Med Chem 48:6162-5 (2005)  
Target
Name:
Thyrotropin-releasing hormone receptor
Synonyms:
Thyrotropin-releasing hormone receptor 2
Type:
PROTEIN
Mol. Mass.:
39044.21
Organism:
Rattus norvegicus
Description:
ChEMBL_532304
Residue:
352
  
Inhibitor
Name:
BDBM50173822
Synonyms:
1-[3-(2-cyclohexyl-1H-4-imidazolyl)-2-[5-oxo-(2S)-tetrahydro-1H-2-pyrrolylcarboxamido]-(2S)-propanoyl]-(2S)-tetrahydro-1H-2-pyrrolecarboxamide | CHEMBL382080
Type:
Small organic molecule
Emp. Form.:
C22H32N6O4
Mol. Mass.:
444.5273
SMILES:
NC(=O)[C@@H]1CCCN1C(=O)[C@H](Cc1cnc([nH]1)C1CCCCC1)NC(=O)[C@@H]1CCC(=O)N1
: