Target
Dual specificity mitogen-activated protein kinase kinase 1
Ligand
BDBM50173837
Substrate
Meas. Tech.
ChEMBL_326808 (CHEMBL860398)
IC50
800±n/a nM
Citation
 Gavrin, LKGreen, NHu, YJanz, KKaila, NLi, HQTam, SYThomason, JRGopalsamy, ACiszewski, GCuozzo, JWHall, JPHsu, STelliez, JBLin, LL Inhibition of Tpl2 kinase and TNF-alpha production with 1,7-naphthyridine-3-carbonitriles: synthesis and structure-activity relationships. Bioorg Med Chem Lett 15:5288-92 (2005)  
Target
Name:
Dual specificity mitogen-activated protein kinase kinase 1
Synonyms:
Dual specificity mitogen-activated protein kinase (MEK) Dual specificity mitogen-activated protein kinase kinase 1 (MEK1) Dual specificity mitogen-activated protein kinase kinase MEK1/2 MAP kinase kinase 1 MAPK/ERK kinase 1 MEK-1 MP2K1_HUMAN PRKMK1 | VHL-MAP2K1/MAP2K2
Type:
Other Protein Type
Mol. Mass.:
43439.03
Organism:
Homo sapiens (Human)
Description:
Full-length human MEK-1 was generated by PCR and purified as a fusion protein from Escherichia coli lysates.
Residue:
393
  
Inhibitor
Name:
BDBM50173837
Synonyms:
6-(2-morpholinoethylamino)-4-(4-phenoxyphenylamino)-1,7-naphthyridine-3-carbonitrile CHEMBL371095
Type:
Small organic molecule
Emp. Form.:
C27H26N6O2
Mol. Mass.:
466.5343
SMILES:
N#Cc1cnc2cnc(NCCN3CCOCC3)cc2c1Nc1ccc(Oc2ccccc2)cc1
: