Target
Excitatory amino acid transporter 1
Ligand
BDBM50173935
Substrate
Meas. Tech.
ChEMBL_321548 (CHEMBL881962)
IC50
2000±n/a nM
Citation
 Greenfield, AGrosanu, CDunlop, JMcIlvain, BCarrick, TJow, BLu, QKowal, DWilliams, JButera, J Synthesis and biological activities of aryl-ether-, biaryl-, and fluorene-aspartic acid and diaminopropionic acid analogs as potent inhibitors of the high-affinity glutamate transporter EAAT-2. Bioorg Med Chem Lett 15:4985-8 (2005)  
Target
Name:
Excitatory amino acid transporter 1
Synonyms:
EAA1_HUMAN Excitatory Amino Acid EAAT1 GLAST1 | SLC1A3
Type:
Enzyme Catalytic Domain
Mol. Mass.:
59577.19
Organism:
Homo sapiens (Human)
Description:
Excitatory Amino Acid EAAT1 0 HUMAN::P43003
Residue:
542
  
Inhibitor
Name:
BDBM50173935
Synonyms:
2-Amino-N-biphenyl-4-yl-succinamic acid | CHEMBL198315
Type:
Small organic molecule
Emp. Form.:
C16H16N2O3
Mol. Mass.:
284.3098
SMILES:
NC(CC(=O)Nc1ccc(cc1)-c1ccccc1)C(O)=O
: