Target
Mast/stem cell growth factor receptor Kit
Ligand
BDBM50004233
Substrate
Meas. Tech.
ChEMBL_323029 (CHEMBL873572)
IC50
>10000±n/a nM
Citation
 Vendôme, JLetard, SMartin, FSvinarchuk, FDubreuil, PAuclair, CLe Bret, M Molecular modeling of wild-type and D816V c-Kit inhibition based on ATP-competitive binding of ellipticine derivatives to tyrosine kinases. J Med Chem 48:6194-201 (2005)  
Target
Name:
Mast/stem cell growth factor receptor Kit
Synonyms:
CD117 antigen KIT Mast/stem cell growth factor receptor Kit (cKIT) Proto-oncogene tyrosine-protein kinase Kit Stem cell growth factor receptor Tyrosine-protein kinase Kit c-kit v-kit Hardy-Zuckerman 4 feline sarcoma viral oncogene homolog
Type:
Protein
Mol. Mass.:
109869.37
Organism:
Homo sapiens (Human)
Description:
P10721
Residue:
976
  
Inhibitor
Name:
BDBM50004233
Synonyms:
5,11-dimethyl-2H-pyrido[4,3-b]carbazole ELLIPTECINE Ellipticine cid_3213
Type:
Small organic molecule
Emp. Form.:
C17H14N2
Mol. Mass.:
246.3065
SMILES:
Cc1c2[nH]c3ccccc3c2c(C)c2cnccc12
: