Target
5-hydroxytryptamine receptor 4
Ligand
BDBM50174414
Substrate
Meas. Tech.
ChEMBL_320933 (CHEMBL882452)
Ki
5±n/a nM
Citation
 Soulier, JLRusso, OGiner, MRivail, LBerthouze, MOngeri, SMaigret, BFischmeister, RLezoualc'h, FSicsic, SBerque-Bestel, I Design and synthesis of specific probes for human 5-HT4 receptor dimerization studies. J Med Chem 48:6220-8 (2005)  
Target
Name:
5-hydroxytryptamine receptor 4
Synonyms:
5-HT-4 5-HT4S 5-HT4b 5-HT4d 5-hydroxytryptamine receptor 4 5HT4R_HUMAN Serotonin (5-HT) receptor Serotonin 4 (5-HT4) receptor | Serotonin Receptor 4
Type:
Enzyme
Mol. Mass.:
43767.54
Organism:
Homo sapiens (Human)
Description:
Q13639
Residue:
388
  
Inhibitor
Name:
BDBM50174414
Synonyms:
4-(3-{1-[2-(4-amino-5-chloro-2-hydroxyphenylcarbonyloxy)ethyl]hexahydro-4-pyridinylcarbamoyl}propylcarboxamido)-1-[2-(4-amino-5-chloro-2-methoxyphenylcarbonyloxy)ethyl]hexahydropyridine | CHEMBL197752
Type:
Small organic molecule
Emp. Form.:
C34H46Cl2N6O8
Mol. Mass.:
737.67
SMILES:
COc1cc(N)c(Cl)cc1C(=O)OCCN1CCC(CC1)NC(=O)CCCC(=O)NC1CCN(CCOC(=O)c2cc(Cl)c(N)cc2O)CC1
: