Target
5-hydroxytryptamine receptor 4
Ligand
BDBM50174443
Substrate
Meas. Tech.
ChEMBL_320933 (CHEMBL882452)
Ki
10±n/a nM
Citation
 Soulier, JLRusso, OGiner, MRivail, LBerthouze, MOngeri, SMaigret, BFischmeister, RLezoualc'h, FSicsic, SBerque-Bestel, I Design and synthesis of specific probes for human 5-HT4 receptor dimerization studies. J Med Chem 48:6220-8 (2005)  
Target
Name:
5-hydroxytryptamine receptor 4
Synonyms:
5-HT-4 5-HT4S 5-HT4b 5-HT4d 5-hydroxytryptamine receptor 4 5HT4R_HUMAN Serotonin (5-HT) receptor Serotonin 4 (5-HT4) receptor | Serotonin Receptor 4
Type:
Enzyme
Mol. Mass.:
43767.54
Organism:
Homo sapiens (Human)
Description:
Q13639
Residue:
388
  
Inhibitor
Name:
BDBM50174443
Synonyms:
1-[2-(4-amino-5-chloro-2-methoxyphenylcarbonyloxy)ethyl]-4-{2-[2-(2-{1-[2-(4-amino-5-chloro-2-methoxyphenylcarbonyloxy)ethyl]hexahydro-4-pyridinyl}ethylcarbamoyl)ethylcarboxamido]ethyl}hexahydropyridine | CHEMBL370181
Type:
Small organic molecule
Emp. Form.:
C38H54Cl2N6O8
Mol. Mass.:
793.777
SMILES:
COc1cc(N)c(Cl)cc1C(=O)OCCN1CCC(CCNC(=O)CCC(=O)NCCC2CCN(CCOC(=O)c3cc(Cl)c(N)cc3OC)CC2)CC1
: