Target
Seed linoleate 13S-lipoxygenase-1
Ligand
BDBM50174559
Substrate
Meas. Tech.
ChEMBL_321515 (CHEMBL880575)
IC50
37000±n/a nM
Citation
 Kontogiorgis, CAHadjipavlou-Litina, DJ Synthesis and antiinflammatory activity of coumarin derivatives. J Med Chem 48:6400-8 (2005)  
Target
Name:
Seed linoleate 13S-lipoxygenase-1
Synonyms:
15-LOX 15-lipo-oxygenase (SLO) L-1 LOX1.1 Lipoxygenase (LOX) Lipoxygenase-1 | Seed lipoxygenase-1
Type:
Enzyme
Mol. Mass.:
94365.66
Organism:
Glycine max (soybean)
Description:
Residue:
839
  
Inhibitor
Name:
BDBM50174559
Synonyms:
7-Hydroxy-8-piperidin-1-ylmethyl-chromen-2-one CHEMBL193416
Type:
Small organic molecule
Emp. Form.:
C15H17NO3
Mol. Mass.:
259.3004
SMILES:
Oc1ccc2ccc(=O)oc2c1CN1CCCCC1
: