Target
Enoyl-acyl-carrier protein reductase
Ligand
BDBM50174764
Substrate
Meas. Tech.
ChEMBL_326719 (CHEMBL858717)
IC50
320±n/a nM
Citation
 Freundlich, JSAnderson, JWSarantakis, DShieh, HMYu, MValderramos, JCLucumi, EKuo, MJacobs, WRFidock, DASchiehser, GAJacobus, DPSacchettini, JC Synthesis, biological activity, and X-ray crystal structural analysis of diaryl ether inhibitors of malarial enoyl acyl carrier protein reductase. Part 1: 4'-substituted triclosan derivatives. Bioorg Med Chem Lett 15:5247-52 (2005)  
Target
Name:
Enoyl-acyl-carrier protein reductase
Synonyms:
Type:
PROTEIN
Mol. Mass.:
49770.86
Organism:
Plasmodium falciparum
Description:
ChEMBL_795989
Residue:
432
  
Inhibitor
Name:
BDBM50174764
Synonyms:
5-Chloro-2-[2-chloro-4-(2-hydroxy-benzylamino)-phenoxy]-phenol | CHEMBL197274
Type:
Small organic molecule
Emp. Form.:
C19H15Cl2NO3
Mol. Mass.:
376.233
SMILES:
Oc1ccccc1CNc1ccc(Oc2ccc(Cl)cc2O)c(Cl)c1
: