Target
Extracellular calcium-sensing receptor
Ligand
BDBM50175387
Substrate
Meas. Tech.
ChEMBL_326644 (CHEMBL863377)
IC50
30±n/a nM
Citation
 Gavai, AVVaz, RJMikkilineni, ABRoberge, JYLiu, YLawrence, RMCorte, JRYang, WBednarz, MDickson, JKMa, ZSeethala, RFeyen, JH Discovery of novel 1-arylmethyl pyrrolidin-2-yl ethanol amines as calcium-sensing receptor antagonists. Bioorg Med Chem Lett 15:5478-82 (2005)  
Target
Name:
Extracellular calcium-sensing receptor
Synonyms:
CASR CaR Calcium-sensing receptor (CaSR) GPRC2A Parathyroid Cell calcium-sensing receptor Synonyms=GPRC2A | hCasR
Type:
Protein
Mol. Mass.:
120663.13
Organism:
Homo sapiens (Human)
Description:
P41180
Residue:
1078
  
Inhibitor
Name:
BDBM50175387
Synonyms:
(R)-2-(2-hydroxy-3-(2-methyl-1-(naphthalen-2-yl)propan-2-ylamino)propoxy)benzonitrile CHEMBL382741
Type:
Small organic molecule
Emp. Form.:
C24H26N2O2
Mol. Mass.:
374.4754
SMILES:
CC(C)(Cc1ccc2ccccc2c1)NC[C@@H](O)COc1ccccc1C#N
: