Target
5-hydroxytryptamine receptor 1A
Ligand
BDBM50175479
Substrate
Meas. Tech.
ChEMBL_326565 (CHEMBL859776)
Ki
0.2±n/a nM
Citation
 Kling, ALange, UEMack, HBakker, MHDrescher, KUHornberger, WHutchins, CWMöller, AMüller, RSchmidt, MUnger, LWicke, KSchellhaas, KSteiner, G Synthesis and SAR of highly potent dual 5-HT1A and 5-HT1B antagonists as potential antidepressant drugs. Bioorg Med Chem Lett 15:5567-73 (2005)  
Target
Name:
5-hydroxytryptamine receptor 1A
Synonyms:
5-HT-1A 5-hydroxytryptamine receptor 1A (5-HT-1A) ADRB2RL1 Dopamine D2 receptor and serotonin 1a receptor HTR1A | Serotonin receptor 1A
Type:
Mol. Mass.:
46122.49
Organism:
Homo sapiens (Human)
Description:
Residue:
422
  
Inhibitor
Name:
BDBM50175479
Synonyms:
7-methyl-3-[2-(4-quinolin-8-yl-piperazin-1-yl)-ethyl]-5,6,7,8-tetrahydro-3H-pyrido[4',3':4,5]thieno[2,3-d]pyrimidin-4-one | CHEMBL199443
Type:
Small organic molecule
Emp. Form.:
C25H28N6OS
Mol. Mass.:
460.594
SMILES:
CN1CCc2c(C1)sc1ncn(CCN3CCN(CC3)c3cccc4cccnc34)c(=O)c21
: