Target
Toll-like receptor 2
Ligand
BDBM50175654
Substrate
Meas. Tech.
ChEMBL_326942 (CHEMBL860291)
IC50
1250±n/a nM
Citation
 Spyvee, MRZhang, HHawkins, LDChow, JC Toll-like receptor 2 antagonists. Part 1: preliminary SAR investigation of novel synthetic phospholipids. Bioorg Med Chem Lett 15:5494-8 (2005)  
Target
Name:
Toll-like receptor 2
Synonyms:
TIL4 TLR2_HUMAN Toll-like receptor 2 (TLR2)
Type:
Protein
Mol. Mass.:
89837.58
Organism:
Homo sapiens (Human)
Description:
O60603
Residue:
784
  
Inhibitor
Name:
BDBM50175654
Synonyms:
CHEMBL190383 | Tetradecanoic acid (R)-2-({2-[2-carboxy-3-(4-hydroxy-phenyl)-propionylamino]-ethoxy}-hydroxy-phosphoryloxy)-1-((R)-3-dodecanoyloxy-decyloxymethyl)-ethyl ester
Type:
Small organic molecule
Emp. Form.:
C51H90NO13P
Mol. Mass.:
956.233
SMILES:
CCCCCCCCCCCCCC(=O)O[C@H](COCC[C@@H](CCCCCCC)OC(=O)CCCCCCCCCCC)COP(O)(=O)OCCNC(=O)C(Cc1ccc(O)cc1)C(O)=O
: