Target
Adenosine receptor A1
Ligand
BDBM50176740
Substrate
Meas. Tech.
ChEMBL_327524 (CHEMBL871362)
Ki
740±n/a nM
Citation
 Elzein, EKalla, RLi, XPerry, TParkhill, EPalle, VVarkhedkar, VGimbel, AZeng, DLustig, DLeung, KZablocki, J Novel 1,3-dipropyl-8-(1-heteroarylmethyl-1H-pyrazol-4-yl)-xanthine derivatives as high affinity and selective A2B adenosine receptor antagonists. Bioorg Med Chem Lett 16:302-6 (2005)  
Target
Name:
Adenosine receptor A1
Synonyms:
A1 adenosine receptor (hA1) AA1R_HUMAN ADORA1 Adenosine A1-receptor Adenosine receptor A1 (hA1) | Adenosine transporter (AdT)
Type:
G Protein-Coupled Receptor (GPCR)
Mol. Mass.:
36520.92
Organism:
Homo sapiens (Human)
Description:
P30542
Residue:
326
  
Inhibitor
Name:
BDBM50176740
Synonyms:
8-(1-((3-(4-chlorophenyl)-1,2,4-oxadiazol-5-yl)methyl)-1H-pyrazol-4-yl)-1,3-dipropyl-1H-purine-2,6(3H,7H)-dione | CHEMBL372084
Type:
Small organic molecule
Emp. Form.:
C23H23ClN8O3
Mol. Mass.:
494.934
SMILES:
CCCn1c2nc([nH]c2c(=O)n(CCC)c1=O)-c1cnn(Cc2nc(no2)-c2ccc(Cl)cc2)c1
: