Target
Adenosine receptor A2b
Ligand
BDBM50176767
Substrate
Meas. Tech.
ChEMBL_327523 (CHEMBL871361)
Ki
54±n/a nM
Citation
 Elzein, EKalla, RLi, XPerry, TParkhill, EPalle, VVarkhedkar, VGimbel, AZeng, DLustig, DLeung, KZablocki, J Novel 1,3-dipropyl-8-(1-heteroarylmethyl-1H-pyrazol-4-yl)-xanthine derivatives as high affinity and selective A2B adenosine receptor antagonists. Bioorg Med Chem Lett 16:302-6 (2005)  
Target
Name:
Adenosine receptor A2b
Synonyms:
AA2BR_HUMAN ADORA2B Adenosine receptors A2b | Adenosine receptors; A2a & A2b
Type:
G Protein-Coupled Receptor (GPCR)
Mol. Mass.:
36341.22
Organism:
Homo sapiens (Human)
Description:
Residue:
332
  
Inhibitor
Name:
BDBM50176767
Synonyms:
1,3-dipropyl-8-(1-((3-p-tolyl-1,2,4-oxadiazol-5-yl)methyl)-1H-pyrazol-4-yl)-1H-purine-2,6(3H,7H)-dione | CHEMBL200349
Type:
Small organic molecule
Emp. Form.:
C24H26N8O3
Mol. Mass.:
474.515
SMILES:
CCCn1c2nc([nH]c2c(=O)n(CCC)c1=O)-c1cnn(Cc2nc(no2)-c2ccc(C)cc2)c1
: