Target
Adenosine receptor A2a
Ligand
BDBM50176745
Substrate
Meas. Tech.
ChEMBL_327525 (CHEMBL871363)
Ki
1600±n/a nM
Citation
 Elzein, EKalla, RLi, XPerry, TParkhill, EPalle, VVarkhedkar, VGimbel, AZeng, DLustig, DLeung, KZablocki, J Novel 1,3-dipropyl-8-(1-heteroarylmethyl-1H-pyrazol-4-yl)-xanthine derivatives as high affinity and selective A2B adenosine receptor antagonists. Bioorg Med Chem Lett 16:302-6 (2005)  
Target
Name:
Adenosine receptor A2a
Synonyms:
A2A adenosine receptor (hA2A) ADENOSINE A2 ADORA2 Adenosine A2A receptor (A2AAR)
Type:
G Protein-Coupled Receptor (GPCR)
Mol. Mass.:
44716.46
Organism:
Homo sapiens (Human)
Description:
P29274
Residue:
412
  
Inhibitor
Name:
BDBM50176745
Synonyms:
8-(1-((3-(2-methoxyphenyl)-1,2,4-oxadiazol-5-yl)methyl)-1H-pyrazol-4-yl)-1,3-dipropyl-1H-purine-2,6(3H,7H)-dione | CHEMBL200278
Type:
Small organic molecule
Emp. Form.:
C24H26N8O4
Mol. Mass.:
490.5144
SMILES:
CCCn1c2nc([nH]c2c(=O)n(CCC)c1=O)-c1cnn(Cc2nc(no2)-c2ccccc2OC)c1
: