Target
Metabotropic glutamate receptor 1
Ligand
BDBM50177085
Substrate
Meas. Tech.
ChEMBL_430991 (CHEMBL916419)
IC50
5±n/a nM
Citation
 Zheng, GZBhatia, PDaanen, JKolasa, TPatel, MLatshaw, SEl Kouhen, OFChang, RUchic, MEMiller, LNakane, MLehto, SGHonore, MPMoreland, RBBrioni, JDStewart, AO Structure-activity relationship of triazafluorenone derivatives as potent and selective mGluR1 antagonists. J Med Chem 48:7374-88 (2005)  
Target
Name:
Metabotropic glutamate receptor 1
Synonyms:
GPRC1A GRM1_HUMAN Metabotropic Glutamate 1a | metabotropic glutamate 1
Type:
Enzyme
Mol. Mass.:
132358.19
Organism:
Homo sapiens (Human)
Description:
Q13255
Residue:
1194
  
Inhibitor
Name:
BDBM50177085
Synonyms:
3-Cyclopentyl-9-dimethylamino-3H-pyrido[3',2':4,5]thieno[3,2-d]pyrimidin-4-one CHEMBL224617
Type:
Small organic molecule
Emp. Form.:
C16H18N4OS
Mol. Mass.:
314.405
SMILES:
CN(C)c1ccnc2sc3c(ncn(C4CCCC4)c3=O)c12
: