Target
Metabotropic glutamate receptor 1
Ligand
BDBM50177051
Substrate
Meas. Tech.
ChEMBL_430991 (CHEMBL916419)
IC50
167±n/a nM
Citation
 Zheng, GZBhatia, PDaanen, JKolasa, TPatel, MLatshaw, SEl Kouhen, OFChang, RUchic, MEMiller, LNakane, MLehto, SGHonore, MPMoreland, RBBrioni, JDStewart, AO Structure-activity relationship of triazafluorenone derivatives as potent and selective mGluR1 antagonists. J Med Chem 48:7374-88 (2005)  
Target
Name:
Metabotropic glutamate receptor 1
Synonyms:
GPRC1A GRM1_HUMAN Metabotropic Glutamate 1a | metabotropic glutamate 1
Type:
Enzyme
Mol. Mass.:
132358.19
Organism:
Homo sapiens (Human)
Description:
Q13255
Residue:
1194
  
Inhibitor
Name:
BDBM50177051
Synonyms:
3-azepan-1-yl-9-(dimethylnitroryl)pyrido[3',2':4,5]thieno[3,2-d]pyrimidin-4(3H)-one CHEMBL386408
Type:
Small organic molecule
Emp. Form.:
C17H21N5O2S
Mol. Mass.:
359.446
SMILES:
C[N+](C)([O-])c1ccnc2sc3c(ncn(N4CCCCCC4)c3=O)c12
: