Target
Metabotropic glutamate receptor 1
Ligand
BDBM50177086
Substrate
Meas. Tech.
ChEMBL_430991 (CHEMBL916419)
IC50
98±n/a nM
Citation
 Zheng, GZBhatia, PDaanen, JKolasa, TPatel, MLatshaw, SEl Kouhen, OFChang, RUchic, MEMiller, LNakane, MLehto, SGHonore, MPMoreland, RBBrioni, JDStewart, AO Structure-activity relationship of triazafluorenone derivatives as potent and selective mGluR1 antagonists. J Med Chem 48:7374-88 (2005)  
Target
Name:
Metabotropic glutamate receptor 1
Synonyms:
GPRC1A GRM1_HUMAN Metabotropic Glutamate 1a | metabotropic glutamate 1
Type:
Enzyme
Mol. Mass.:
132358.19
Organism:
Homo sapiens (Human)
Description:
Q13255
Residue:
1194
  
Inhibitor
Name:
BDBM50177086
Synonyms:
3-(4-Ethyl-phenyl)-9-methylamino-3H-pyrido[3',2':4,5]thieno[3,2-d]pyrimidin-4-one CHEMBL374815
Type:
Small organic molecule
Emp. Form.:
C18H16N4OS
Mol. Mass.:
336.411
SMILES:
CCc1ccc(cc1)-n1cnc2c(sc3nccc(NC)c23)c1=O
: