Target
Metabotropic glutamate receptor 5
Ligand
BDBM50177083
Substrate
Meas. Tech.
ChEMBL_430992 (CHEMBL916420)
IC50
>100000±n/a nM
Citation
 Zheng, GZBhatia, PDaanen, JKolasa, TPatel, MLatshaw, SEl Kouhen, OFChang, RUchic, MEMiller, LNakane, MLehto, SGHonore, MPMoreland, RBBrioni, JDStewart, AO Structure-activity relationship of triazafluorenone derivatives as potent and selective mGluR1 antagonists. J Med Chem 48:7374-88 (2005)  
Target
Name:
Metabotropic glutamate receptor 5
Synonyms:
GPRC1E GRM5_HUMAN metabotropic glutamate 5 | metabotropic glutamate 5a
Type:
Enzyme
Mol. Mass.:
132484.72
Organism:
Homo sapiens (Human)
Description:
Residue:
1212
  
Inhibitor
Name:
BDBM50177083
Synonyms:
3-(4-ethylphenyl)-9-[(2-methoxyethyl)(methyl)amino]pyrido[3',2':4,5]thieno[3,2-d]pyrimidin-4(3H)-one CHEMBL225125
Type:
Small organic molecule
Emp. Form.:
C21H22N4O2S
Mol. Mass.:
394.49
SMILES:
CCc1ccc(cc1)-n1cnc2c(sc3nccc(N(C)CCOC)c23)c1=O
: