Target
Dimer of Protein farnesyltransferase subunit beta
Ligand
BDBM50177232
Substrate
Meas. Tech.
ChEMBL_331934 (CHEMBL864054)
IC50
0.1±n/a nM
Citation
 Huang, CYStauffer, TMStrickland, CLReader, JCHuang, HLi, GCooper, ABDoll, RJGanguly, AKBaldwin, JJRokosz, LL Guiding farnesyltransferase inhibitors from an ECLiPS library to the catalytic zinc. Bioorg Med Chem Lett 16:507-11 (2005)  
Target
Name:
Dimer of Protein farnesyltransferase subunit beta
Synonyms:
Protein Farnesyltransferase (PFT) Chain B
Type:
Mol. Mass.:
Description:
ASSAY_ID of EBI is 51428
Components:
This complex has 3 components.
Component 1
Name:
Protein farnesyltransferase subunit beta
Synonyms:
CAAX farnesyltransferase subunit alpha FNTB FTase-alpha GGTase-I-alpha Protein farnesyl/geranylgeranyl transferase Protein farnesyltransferase subunit beta Protein farnesyltransferase/geranylgeranyltransferase type-1 subunit alpha Ras proteins prenyltransferase subunit beta | Type I protein geranyl-geranyltransferase subunit alpha
Type:
Enzyme Subunit
Mol. Mass.:
48766.02
Organism:
Homo sapiens (Human)
Description:
Protein farnesyltransferase subunit beta
Residue:
437
  
Component 2
Name:
Protein farnesyltransferase subunit beta
Synonyms:
CAAX farnesyltransferase subunit alpha FNTB FTase-alpha GGTase-I-alpha Protein farnesyl/geranylgeranyl transferase Protein farnesyltransferase subunit beta Protein farnesyltransferase/geranylgeranyltransferase type-1 subunit alpha Ras proteins prenyltransferase subunit beta | Type I protein geranyl-geranyltransferase subunit alpha
Type:
Enzyme Subunit
Mol. Mass.:
48766.02
Organism:
Homo sapiens (Human)
Description:
Protein farnesyltransferase subunit beta
Residue:
437
  
Inhibitor
Name:
BDBM50177232
Synonyms:
4-(3-bromo-8-chloro-6,11-dihydro-5H-benzo[5,6]cyclohepta[1,2-b]pyridin-11-yl)-piperazine-1,2-dicarboxylic acid 1-cyclohexylamide 2-[(3-imidazol-1-yl-propyl)-amide] CHEMBL381360
Type:
Small organic molecule
Emp. Form.:
C32H39BrClN7O2
Mol. Mass.:
669.055
SMILES:
Clc1ccc2C(N3CCN(C(C3)C(=O)NCCCn3ccnc3)C(=O)NC3CCCCC3)c3ncc(Br)cc3CCc2c1
: