Target
Substance-P receptor
Ligand
BDBM50177375
Substrate
Meas. Tech.
ChEMBL_334652 (CHEMBL854118)
Ki
2.7±n/a nM
Citation
 Shue, HJChen, XSchwerdt, JHPaliwal, SBlythin, DJLin, LGu, DWang, CReichard, GAWang, HPiwinski, JJDuffy, RALachowicz, JECoffin, VLNomeir, AAMorgan, CAVarty, GBShih, NY Cyclic urea derivatives as potent NK1 selective antagonists. Part II: Effects of fluoro and benzylic methyl substitutions. Bioorg Med Chem Lett 16:1065-9 (2006)  
Target
Name:
Substance-P receptor
Synonyms:
NK-1 receptor NK1 Receptor NK1R_HUMAN Neurokinin-1 (NK-1) SPR TACR1 Tachykinin receptor 1 (NK1) | tachykinin
Type:
G Protein-Coupled Receptor (GPCR)
Mol. Mass.:
46254.43
Organism:
Homo sapiens (Human)
Description:
P25103
Residue:
407
  
Inhibitor
Name:
BDBM50177375
Synonyms:
(R)-4-((3,5-bis(trifluoromethyl)benzyloxy)methyl)-4-(4-fluorophenyl)imidazolidin-2-one | CHEMBL381151
Type:
Small organic molecule
Emp. Form.:
C19H15F7N2O2
Mol. Mass.:
436.3234
SMILES:
Fc1ccc(cc1)[C@]1(COCc2cc(cc(c2)C(F)(F)F)C(F)(F)F)CNC(=O)N1
: