Target
Succinate-semialdehyde dehydrogenase, mitochondrial
Ligand
BDBM50177406
Substrate
Meas. Tech.
ChEMBL_332432 (CHEMBL867028)
IC50
>1000000±n/a nM
Citation
 Tao, YHYuan, ZTang, XQXu, HBYang, XL Inhibition of GABA shunt enzymes' activity by 4-hydroxybenzaldehyde derivatives. Bioorg Med Chem Lett 16:592-5 (2005)  
Target
Name:
Succinate-semialdehyde dehydrogenase, mitochondrial
Synonyms:
ALDH5A1 NAD(+)-dependent succinic semialdehyde dehydrogenase SSDH_HUMAN Succinate-semialdehyde dehydrogenase, mitochondrial
Type:
PROTEIN
Mol. Mass.:
57224.70
Organism:
Homo sapiens (Human)
Description:
ChEMBL_1459249
Residue:
535
  
Inhibitor
Name:
BDBM50177406
Synonyms:
4-hydroxybenzaldehyde oxime | CHEMBL202611
Type:
Small organic molecule
Emp. Form.:
C7H7NO2
Mol. Mass.:
137.136
SMILES:
Oc1ccc(CN=O)cc1
: