Target
4-aminobutyrate aminotransferase, mitochondrial
Ligand
BDBM50177410
Substrate
Meas. Tech.
ChEMBL_332431 (CHEMBL867027)
IC50
15500±n/a nM
Citation
 Tao, YHYuan, ZTang, XQXu, HBYang, XL Inhibition of GABA shunt enzymes' activity by 4-hydroxybenzaldehyde derivatives. Bioorg Med Chem Lett 16:592-5 (2005)  
Target
Name:
4-aminobutyrate aminotransferase, mitochondrial
Synonyms:
(S)-3-amino-2-methylpropionate transaminase ABAT GABA transaminase GABA-T GABT_HUMAN L-AIBAT
Type:
PROTEIN
Mol. Mass.:
56449.39
Organism:
Homo sapiens (Human)
Description:
ChEMBL_1459248
Residue:
500
  
Inhibitor
Name:
BDBM50177410
Synonyms:
4-hydroxy-3-nitrobenzaldehyde | CHEMBL378361
Type:
Small organic molecule
Emp. Form.:
C7H5NO4
Mol. Mass.:
167.1189
SMILES:
Oc1ccc(C=O)cc1[N+]([O-])=O
: