Target
4-aminobutyrate aminotransferase, mitochondrial
Ligand
BDBM50177404
Substrate
Meas. Tech.
ChEMBL_332431 (CHEMBL867027)
IC50
>1000000±n/a nM
Citation
 Tao, YHYuan, ZTang, XQXu, HBYang, XL Inhibition of GABA shunt enzymes' activity by 4-hydroxybenzaldehyde derivatives. Bioorg Med Chem Lett 16:592-5 (2005)  
Target
Name:
4-aminobutyrate aminotransferase, mitochondrial
Synonyms:
(S)-3-amino-2-methylpropionate transaminase ABAT GABA transaminase GABA-T GABT_HUMAN L-AIBAT
Type:
PROTEIN
Mol. Mass.:
56449.39
Organism:
Homo sapiens (Human)
Description:
ChEMBL_1459248
Residue:
500
  
Inhibitor
Name:
BDBM50177404
Synonyms:
4-((2S,3R,4R,5S,6R)-3,4,5-trihydroxy-6-(hydroxymethyl)-tetrahydro-2H-pyran-2-yloxy)benzaldehyde CHEMBL201358 | Helicide
Type:
Small organic molecule
Emp. Form.:
C13H16O7
Mol. Mass.:
284.2619
SMILES:
OC[C@H]1O[C@@H](Oc2ccc(C=O)cc2)[C@H](O)[C@H](O)[C@@H]1O
: