Target
Poly [ADP-ribose] polymerase 1
Ligand
BDBM50177451
Substrate
Meas. Tech.
ChEMBL_334702 (CHEMBL862536)
IC50
10±n/a nM
Citation
 Cockcroft, XLDillon, KJDixon, LDrzewiecki, JKerrigan, FLoh, VMMartin, NMMenear, KASmith, GC Phthalazinones 2: Optimisation and synthesis of novel potent inhibitors of poly(ADP-ribose)polymerase. Bioorg Med Chem Lett 16:1040-4 (2006)  
Target
Name:
Poly [ADP-ribose] polymerase 1
Synonyms:
(ARTD1 or PARP1) 2.4.2.30 ADPRT ARTD1 Human diphtheria toxin-like ADP-ribosyltransferase (ARTD1 or PARP1) NT-PARP-1 PARP1 PPOL Poly [ADP-ribose] polymerase 1 (PARP) Poly [ADP-ribose] polymerase 1 (PARP1) Poly [ADP-ribose] polymerase 1, 28-kDa form Poly [ADP-ribose] polymerase 1, processed C-terminus Poly [ADP-ribose] polymerase-1 Poly(ADP-ribose) polymerase-1 (ARTD1/PARP1) Protein poly-ADP-ribosyltransferase PARP1 | Synonyms=ADPRT
Type:
Mol. Mass.:
113114.22
Organism:
Homo sapiens (Human)
Description:
P09874
Residue:
1014
  
Inhibitor
Name:
BDBM50177451
Synonyms:
4-(3-(1-propyl-1,4-diazepane-4-carbonyl)benzyl)phthalazin-1(2H)-one | CHEMBL379251
Type:
Small organic molecule
Emp. Form.:
C24H28N4O2
Mol. Mass.:
404.5047
SMILES:
CCCN1CCCN(CC1)C(=O)c1cccc(Cc2n[nH]c(=O)c3ccccc23)c1
: