Target
Melanocortin receptor 4
Ligand
BDBM50177560
Substrate
Meas. Tech.
ChEMBL_349444 (CHEMBL865696)
Ki
6.4±n/a nM
Citation
 Shi, QOrnstein, PLBriner, KRichardson, TIArnold, MBBacker, RTBuckmaster, JLCanada, EJDoecke, CWHertel, LWHonigschmidt, NHsiung, HMHusain, SKuklish, SLMartinelli, MJMullaney, JTO'Brien, TPReinhard, MRRothhaar, RShah, JWu, ZXie, CZgombick, JMFisher, MJ Synthesis and structure-activity relationships of novel dipeptides and reduced dipeptides as ligands for melanocortin subtype-4 receptor. Bioorg Med Chem Lett 16:2341-6 (2006)  
Target
Name:
Melanocortin receptor 4
Synonyms:
MC4-R MC4R_HUMAN Melanocortin receptor 4 (MC-4) Melanocortin receptor 4 (MC4R)
Type:
Enzyme
Mol. Mass.:
36949.50
Organism:
Homo sapiens (Human)
Description:
P32245
Residue:
332
  
Inhibitor
Name:
BDBM50177560
Synonyms:
CHEMBL206042 | N-((R)-3-(4-chlorophenyl)-1-(4-(1-(2-chlorophenyl)-2-(diethylamino)ethyl)piperazin-1-yl)-1-oxopropan-2-yl)-2-(1,2,3,4-tetrahydroisoquinolin-1-yl)acetamide
Type:
Small organic molecule
Emp. Form.:
C36H45Cl2N5O2
Mol. Mass.:
650.681
SMILES:
CCN(CC)CC(N1CCN(CC1)C(=O)[C@@H](Cc1ccc(Cl)cc1)NC(=O)CC1NCCc2ccccc12)c1ccccc1Cl
: