Target
Mu-type opioid receptor
Ligand
BDBM50177691
Substrate
Meas. Tech.
ChEMBL_333516 (CHEMBL866455)
Ki
160±n/a nM
Citation
 Le Bourdonnec, BGoodman, AJMichaut, MYe, HFGraczyk, TMBelanger, SDeHaven, RNDolle, RE Synthesis and structure-activity relationships of a new series of 2alpha-substituted trans-4,5-dimethyl-4-(3-hydroxyphenyl)piperidine as mu-selective opioid antagonists. Bioorg Med Chem Lett 16:864-8 (2006)  
Target
Name:
Mu-type opioid receptor
Synonyms:
M-OR-1 MOR-1 MUOR1 Mu opiate receptor OPRM1 hMOP | mu-type opioid receptor isoform MOR-1
Type:
G Protein-Coupled Receptor (GPCR)
Mol. Mass.:
44789.51
Organism:
Homo sapiens (Human)
Description:
P35372
Residue:
400
  
Inhibitor
Name:
BDBM50177691
Synonyms:
3-(trans-4,5-dimethyl-1,2(alpha)-diphenethylpiperidin-4-yl)phenol | CHEMBL201434
Type:
Small organic molecule
Emp. Form.:
C29H35NO
Mol. Mass.:
413.5943
SMILES:
C[C@H]1CN(CCc2ccccc2)[C@H](CCc2ccccc2)C[C@@]1(C)c1cccc(O)c1
: