Target
Vascular endothelial growth factor receptor 2
Ligand
BDBM50002579
Substrate
Meas. Tech.
ChEMBL_326140 (CHEMBL862695)
IC50
2.4±n/a nM
Citation
 Wissner, AFloyd, MBJohnson, BDFraser, HIngalls, CNittoli, TDushin, RGDiscafani, CNilakantan, RMarini, JRavi, MCheung, KTan, XMusto, SAnnable, TSiegel, MMLoganzo, F 2-(Quinazolin-4-ylamino)-[1,4]benzoquinones as covalent-binding, irreversible inhibitors of the kinase domain of vascular endothelial growth factor receptor-2. J Med Chem 48:7560-81 (2005)  
Target
Name:
Vascular endothelial growth factor receptor 2
Synonyms:
CD_antigen=CD309 Fetal liver kinase 1 (FLK-1) KDR Protein-tyrosine kinase receptor Flk-1 VEGFR-2 VEGFR2 Vascular Endothelial Growth Factor Receptor Kinase 2 Vascular endothelial growth factor receptor 2 (KDR) Vascular endothelial growth factor receptor 2 (VEGFR2) Vascular endothelial growth factor receptor-2 (VEGFR-2)
Type:
Receptor Tyrosine Kinase
Mol. Mass.:
151510.97
Organism:
Homo sapiens (Human)
Description:
P35968
Residue:
1356
  
Inhibitor
Name:
BDBM50002579
Synonyms:
CHEMBL2113164
Type:
Small organic molecule
Emp. Form.:
C24H26F2N4O5
Mol. Mass.:
488.4838
SMILES:
COc1cc2c(NC3=CC(=O)C(OCC(F)F)=CC3=O)ncnc2cc1OCCCN1CCCC1
: